BDBM42077 4-({[(2-phenyl-5H-chromeno[2,3-d]pyrimidin-4-yl)thio]acetyl}amino)benzoic acid::4-[2-[(2-phenyl-5H-chromeno[2,3-d]pyrimidin-4-yl)sulfanyl]ethanoylamino]benzoic acid::4-[[1-oxo-2-[(2-phenyl-5H-[1]benzopyrano[2,3-d]pyrimidin-4-yl)thio]ethyl]amino]benzoic acid::4-[[2-[(2-phenyl-5H-chromeno[2,3-d]pyrimidin-4-yl)sulfanyl]acetyl]amino]benzoic acid::4-[[2-[(2-phenyl-5H-chromeno[2,3-d]pyrimidin-4-yl)thio]acetyl]amino]benzoic acid::MLS000673043::SMR000314284::cid_2150415
SMILES OC(=O)c1ccc(NC(=O)CSc2nc(nc3Oc4ccccc4Cc23)-c2ccccc2)cc1
InChI Key InChIKey=KZLVQBYYNLIBBO-UHFFFAOYSA-N
Data  3 IC50
  Tab Delimited (TSV)   2D SDfile   Computed 3D by Vconf -m prep SDfile
Find this compound or compounds like it in BindingDB:
Activity Spreadsheet -- Enzyme Inhibition Constant Data from BindingDB
Found 1 hit for monomerid = 42077
TargetGlycoprotein 42(Human herpesvirus 4 type 2)
Emory University
Curated by PubChem BioAssay
LigandPNGBDBM42077(4-({[(2-phenyl-5H-chromeno[2,3-d]pyrimidin-4-yl)th...)
Affinity DataIC50:  1.51E+3nM. Assay description: NIH Molecular Libraries Screening Centers Network [MLSCN] Emory Chemical Biology Discovery Center in MLSCN Assay provider: Theodore Jardetzky; Northw...
In DepthDetails PCBioAssay